﻿InstituteId,InstituteCourseCode,InstituteCode,InstituteName,InstituteAddress,InstituteStateId,SId,FristName,MidName,LastName,FatherName,MotherName,Gender,DateofBirth,Email,MobNo,AadharNo,Nationality,Disability,ComAddress,PerAddress,PinCode,StateId,TenthBoard,TenthPYear,TenthRoll,TenthEStatus,TenthPercent,TwelveBoard,TwelvePYear,TwelveRoll,TwelveEStatus,TwelvePercent,ApplicationNo,Category,CrDistrictId,PrPin,PrStateId,PrDistrictId
484,0566,DL003,The Blind Relief Association,"Lal Bahadur Shastri Marg, Near Oberoi Hotel, New Delhi-110003 Tel.No.: 011-24368529, 65650969/70 Fax No. 011-24374730 Email.: blindrelief@gmail.com ; website: www.blindrelief.org",07,42482,mohit,kumar,saini,rajesh raturi,kanta raturi,Female,1999-07-26 00:00:00,anjaliraturi06@gmail.com,8283901953,532666699273,indian,1,#20 street 19 shaheed bhagat singh nagar dugri,#20 street 19 shaheed bhagat singh nagar dugri,136129,03,punjab school education board,2014,1014410431,550,84,cbsc board,2016,2759156,A1,89.2,200928102693,PWD,46,141013,03,46
484,0566,DL003,The Blind Relief Association,"Lal Bahadur Shastri Marg, Near Oberoi Hotel, New Delhi-110003 Tel.No.: 011-24368529, 65650969/70 Fax No. 011-24374730 Email.: blindrelief@gmail.com ; website: www.blindrelief.org",07,42482,mohit,kumar,saini,rajesh raturi,kanta raturi,Female,1999-07-26 00:00:00,anjaliraturi06@gmail.com,8283901953,532666699273,indian,1,#20 street 19 shaheed bhagat singh nagar dugri,#20 street 19 shaheed bhagat singh nagar dugri,136129,03,punjab school education board,2014,1014410431,550,84,cbsc board,2016,2759156,A1,89.2,200928102693,PWD,46,141013,03,46
484,0566,DL003,The Blind Relief Association,"Lal Bahadur Shastri Marg, Near Oberoi Hotel, New Delhi-110003 Tel.No.: 011-24368529, 65650969/70 Fax No. 011-24374730 Email.: blindrelief@gmail.com ; website: www.blindrelief.org",07,23715,PRIYA,,SHARMA,RAJENDRA KUMAR SHARMA,USHA SHARMA,Female,2002-04-20 00:00:00,r.paota@gmail.com,8233465810,252116070206,INDIAN,0,NEAR MAHARANA PRATAP SECONDARY SCHOOL VPO PAOTA TEHSIL PAOTA DISTRICT JAIPUR,NEAR MAHARANA PRATAP SECONDARY SCHOOL VPO PAOTA TEHSIL PAOTA DISTRICT JAIPUR,303106,08,CBSE,2018,1163819,421,84.2,CBSE,2020,11652829,433,86.6,200924311073,General,120,303106,08,120
484,0566,DL003,The Blind Relief Association,"Lal Bahadur Shastri Marg, Near Oberoi Hotel, New Delhi-110003 Tel.No.: 011-24368529, 65650969/70 Fax No. 011-24374730 Email.: blindrelief@gmail.com ; website: www.blindrelief.org",07,108180,UMER,,SIDIQ,MOHD SIDIQ DOBI,SHAZADA BANU,Male,1997-06-11 00:00:00,sidiqumer@gmail.com,8265968575,715704309276,INDIAN,1,BATT MOHALLA SUMBAL SONAWARI,BATT MOHALLA SUMBAL SONAWARI,193501,01,CBSE,2014,5311966,00,66.50,CBSE,2016,5807626,431,86.20,200930589276,PWD,03,193501,01,03
484,0566,DL003,The Blind Relief Association,"Lal Bahadur Shastri Marg, Near Oberoi Hotel, New Delhi-110003 Tel.No.: 011-24368529, 65650969/70 Fax No. 011-24374730 Email.: blindrelief@gmail.com ; website: www.blindrelief.org",07,24294,M SWAROOPA,,,M MANO NAICK,M APARANJI,Female,1997-08-27 00:00:00,sekharnaick@gmail.com,7993243003,307417023084,INDIAN,0,4-846 SALI STREET GREAMSPET CHITTOOR,4-846 SALI STREET GREAMSPET CHITTOOR,517002,28,SSC AP,2012,1218115879,87,80.7,BIE AP,2014,1409216501,846,84.6,200925210301,ST,573,517002,28,573
484,0566,DL003,The Blind Relief Association,"Lal Bahadur Shastri Marg, Near Oberoi Hotel, New Delhi-110003 Tel.No.: 011-24368529, 65650969/70 Fax No. 011-24374730 Email.: blindrelief@gmail.com ; website: www.blindrelief.org",07,5839,RAVI,,SOLANKI,ASHOK KUMAR,RENU,Male,2002-12-05 00:00:00,ravisolanki5051@gmail.com,8824981957,346451681485,indian,0,DARJIYO KA BASS JHAK,DARJIYO KA BASS JHAK,342602,08,RBSE,2017,1906477,478,79.67%,RBSE,2019,2643495,408,81.60%,200919002396,OBC,125,342602,08,125
484,0566,DL003,The Blind Relief Association,"Lal Bahadur Shastri Marg, Near Oberoi Hotel, New Delhi-110003 Tel.No.: 011-24368529, 65650969/70 Fax No. 011-24374730 Email.: blindrelief@gmail.com ; website: www.blindrelief.org",07,6472,SANU,,FAUJDAR,JAIDEV,MEENA,Male,2004-11-12 00:00:00,sanufojdar0000@gmail.com,9414389731,242656653950,INDIAN,0,VILLAGE- LUHASA POST- LUHASA TEHSIL- NADBAI,VILLAGE- LUHASA POST- LUHASA TEHSIL- NADBAI,321602,08,RBSE AJMER,2018,1492171,442,73.67,RBSE AJMER,2020,3010311,402,80.40,200920162792,OBC,109,321602,08,109
484,0566,DL003,The Blind Relief Association,"Lal Bahadur Shastri Marg, Near Oberoi Hotel, New Delhi-110003 Tel.No.: 011-24368529, 65650969/70 Fax No. 011-24374730 Email.: blindrelief@gmail.com ; website: www.blindrelief.org",07,114856,gaurav,,tailor,rakesh tailor,hansa devi,Male,2001-02-23 00:00:00,gauravtailor43@gmail.com,7891589866,310626547815,indian,0,triveni nagar imli gate ke bahar jhalrapatan,triveni nagar imli gate ke bahar jhalrapatan,326023,08,RBSC,2016,1866596,449,74.83,RBSC,2018,2626025,402,80.40,200930367815,OBC,127,326023,08,123
484,0566,DL003,The Blind Relief Association,"Lal Bahadur Shastri Marg, Near Oberoi Hotel, New Delhi-110003 Tel.No.: 011-24368529, 65650969/70 Fax No. 011-24374730 Email.: blindrelief@gmail.com ; website: www.blindrelief.org",07,33696,MS.ANJALI,,TAILOR,HEMANT TAILOR,MANJU TAILOR,Female,2001-11-12 00:00:00,anjalitailor122001@gmail.com,8905327611,221413261081,INDIAN,0,PLOT NO 16 MOHIT VIHAR BAD SHYOPUR,PLOT NO 16 MOHIT VIHAR BAD SHYOPUR,302022,08,RBSE AJMER,2017,3622849,417,69.50,RBSE AJMER,2019,2586425,398,79.60,200927442983,OBC,120,302022,08,120
484,0566,DL003,The Blind Relief Association,"Lal Bahadur Shastri Marg, Near Oberoi Hotel, New Delhi-110003 Tel.No.: 011-24368529, 65650969/70 Fax No. 011-24374730 Email.: blindrelief@gmail.com ; website: www.blindrelief.org",07,146338,MOHAMMED,KASIM,,NIZAM AHMED,SWALEHA BEGUM,Male,2000-12-08 00:00:00,kasimraza2121@gmail.com,7339978178,382733958704,INDIAN,0,NEHRU NAGAR KOTRI,NEHRU NAGAR KOTRI,311603,08,RBSC AJMER,2017,1527545,432,72.00,RBSC AJMER,2019,2547766,397,79.40,201020208704,OBC,110,311603,08,110
484,0566,DL003,The Blind Relief Association,"Lal Bahadur Shastri Marg, Near Oberoi Hotel, New Delhi-110003 Tel.No.: 011-24368529, 65650969/70 Fax No. 011-24374730 Email.: blindrelief@gmail.com ; website: www.blindrelief.org",07,50632,Kavita,,Kumari,Bhagya singh,Mukesh devi,Female,2002-01-26 00:00:00,abhisheksingh.t32@gmail.com,7232093924,477361158160,INDIA,0,V/P TIGHRAIYA TEH-TODABHIM DISTRICT-KARAULI,V/P TIGHRAIYA TEH-TODABHIM DISTRICT-KARAULI,322254,08,RBSE,2017,2359728,417,69.50%,RBSE,2019,3461513,390,78.00%,200929295835,OBC,126,322254,08,126
484,0566,DL003,The Blind Relief Association,"Lal Bahadur Shastri Marg, Near Oberoi Hotel, New Delhi-110003 Tel.No.: 011-24368529, 65650969/70 Fax No. 011-24374730 Email.: blindrelief@gmail.com ; website: www.blindrelief.org",07,132449,MS SHWETA,,,NARESH KUMAR,POONAM DEVI,Female,2001-09-29 00:00:00,rcpbhadra.com@gmail.com,7217781853,541477480298,INDIA,0,VPO DOONGARANA TEH BHADRA DIST HANUMANGARH,VPO DOONGARANA TEH BHADRA DIST HANUMANGARH,335502,08,BSER AJMER,2017,2324425,342,57,BSER AJMER,2019,2747927,389,77.80,201013270298,General,119,335502,08,119
484,0566,DL003,The Blind Relief Association,"Lal Bahadur Shastri Marg, Near Oberoi Hotel, New Delhi-110003 Tel.No.: 011-24368529, 65650969/70 Fax No. 011-24374730 Email.: blindrelief@gmail.com ; website: www.blindrelief.org",07,17692,MADHU,,RAI,SHESH NARAYAN RAI,SUSHILA RAI,Female,1995-08-25 00:00:00,raim6813@gmail.com,9717509627,323046177235,INDIAN,1,"AICB, BRAILE BHAWAN ROHINI SECTOR 5 ,","VILLAGE PESARA , PESARA, JAUNPUR",110085,07,BOARD OF HIGH SCHOOL AND INTERMEDIATE EDUCATION UP,2013,3555096,404,80.80,BOARD OF HIGH SCHOOL AND INTERMEDIATE EDUCATION UP,2015,2617743,386,77.20,200923573953,General,96,222142,09,176
484,0566,DL003,The Blind Relief Association,"Lal Bahadur Shastri Marg, Near Oberoi Hotel, New Delhi-110003 Tel.No.: 011-24368529, 65650969/70 Fax No. 011-24374730 Email.: blindrelief@gmail.com ; website: www.blindrelief.org",07,41347,Km,Usha,Prajapati,Harihar Prasad,Ramkeshari Devi,Female,1994-10-02 00:00:00,ushaprajapati727@gmail.com,8587801179,802709391440,Indian,1,Jewaniya Pradhanpur Ballia,Jewaniya Pradhanpur Ballia,221712,09,UP Board,2012,3692812,456,76,UP Board,2014,2802897,376,75.20,200928255478,OBC,147,221712,09,147
484,0566,DL003,The Blind Relief Association,"Lal Bahadur Shastri Marg, Near Oberoi Hotel, New Delhi-110003 Tel.No.: 011-24368529, 65650969/70 Fax No. 011-24374730 Email.: blindrelief@gmail.com ; website: www.blindrelief.org",07,11846,SACHIN,,RAWAT,OMPRAKASH,SUNITA DEVI,Male,2001-01-03 00:00:00,sachinrawat91500@gmail.com,8619754972,733635489882,INDIAN,0,"WARD 03, PANIYALA, KOTPUTLI, JAIPUR","WARD 03, PANIYALA, KOTPUTLI, JAIPUR",303108,08,BSER,2015,0485869,350,58.33,BSER,2017,3161220,373,74.60,200921522163,OBC,120,303108,08,120
484,0566,DL003,The Blind Relief Association,"Lal Bahadur Shastri Marg, Near Oberoi Hotel, New Delhi-110003 Tel.No.: 011-24368529, 65650969/70 Fax No. 011-24374730 Email.: blindrelief@gmail.com ; website: www.blindrelief.org",07,132158,SATYENDRA,,KUSHWAH,GIRIRAJ KUSHWAH,SAVITRI BAI,Male,2003-07-16 00:00:00,rohitkushwah2626@gmail.com,9166276433,241537921696,INDIAN,0,KUSHWAH MOHALLA SORTI DARWAJA KARWAD,KUSHWAH MOHALLA SORTI DARWAJA KARWAD,325004,08,RBSE AJMER,2018,1938676,365,60.83,RBSE AJMER,2020,3258084,373,74.60,201013581696,OBC,127,325004,08,127
484,0566,DL003,The Blind Relief Association,"Lal Bahadur Shastri Marg, Near Oberoi Hotel, New Delhi-110003 Tel.No.: 011-24368529, 65650969/70 Fax No. 011-24374730 Email.: blindrelief@gmail.com ; website: www.blindrelief.org",07,146537,SHAKIR,,PATHAN,JHAKIR PATHAN,JAMILA BANU,Male,2001-02-17 00:00:00,shakirkhan3464@gmail.com,9664346495,862644844209,INDIAN,0,NEHRU NAGAR KOTRI,NEHRU NAGAR KOTRI,311603,08,CBSE,2017,1136770,352,70.40,RBSC,2019,2547792,370,74.00,201020334209,General,110,311603,08,110
484,0566,DL003,The Blind Relief Association,"Lal Bahadur Shastri Marg, Near Oberoi Hotel, New Delhi-110003 Tel.No.: 011-24368529, 65650969/70 Fax No. 011-24374730 Email.: blindrelief@gmail.com ; website: www.blindrelief.org",07,140425,SANGEETA,,,ANOPA RAM,SHANTI DEVI,Female,2002-02-25 00:00:00,vinodbishnoi82900@gmail.com,9950014884,296003750847,INDIAN,0,VPO RANJEETPURA TEH BAJJU,VPO RANJEETPURA TEH BAJJU,334305,08,BSER AJMER,2017,1566600,304,50.67,BSER AJMER,2019,3043959,365,73.00,201015210847,OBC,111,334305,08,111
484,0566,DL003,The Blind Relief Association,"Lal Bahadur Shastri Marg, Near Oberoi Hotel, New Delhi-110003 Tel.No.: 011-24368529, 65650969/70 Fax No. 011-24374730 Email.: blindrelief@gmail.com ; website: www.blindrelief.org",07,43058,Shalini,,Chaudhary,Vijay Pratap Singh,Kavita chaudhary,Female,2001-07-20 00:00:00,chaudharyconstructionco2@gmail.com,9536900994,420406713937,Indian,0,H. No 511 sec 10 AWAS VIKAS COLONY SIKANDRA,"Prakash Nagar colony murshan road sadabad 
Hathars",282007,09,Board of high school and intermediate education u. p,2015,0030138,474,79%,Board of high school and intermediate education u.p.,2017,0026472,360,72%,200929303716,OBC,137,281306,09,174
484,0566,DL003,The Blind Relief Association,"Lal Bahadur Shastri Marg, Near Oberoi Hotel, New Delhi-110003 Tel.No.: 011-24368529, 65650969/70 Fax No. 011-24374730 Email.: blindrelief@gmail.com ; website: www.blindrelief.org",07,120511,RASHMIRANJAN,,PRADHAN,BALARAM PRADHAN,LILIRANI PRADHAN,Female,1999-05-27 00:00:00,rashmiranjanpradhan564@gmail.com,9438008818,570477312321,INDIAN,0,"AT/PO-SANATRIBIDA ,PS-KANIHA","AT/PO-SANATRIBIDA ,PS-KANIHA",759117,21,"BOARD OF SECONDARY,ODISHA",2014,066AE061,468,78,"CHSE,ODISHA",2016,342DA022,436,72,200930502321,General,392,759117,21,392
484,0566,DL003,The Blind Relief Association,"Lal Bahadur Shastri Marg, Near Oberoi Hotel, New Delhi-110003 Tel.No.: 011-24368529, 65650969/70 Fax No. 011-24374730 Email.: blindrelief@gmail.com ; website: www.blindrelief.org",07,12668,PAVAN,,KUMAR,RAGHUVIR SHARMA,VIDYA DEVI,Male,1997-05-06 00:00:00,pk273692@gmail.com,6377535963,436389227996,INDIAN,0,"PAVAN KUMAR SO RAGHUVIR SHARMA, 8 DWM, P.O. BIORMANA","PAVAN KUMAR SO RAGHUVIR SHARMA, 8 DWM, P.O. BIORMANA",335704,08,BSER AJMER,2012,0788250,299,49.83,BSER AJMER,2016,3233396,358,71.60,200922244682,General,118,335704,08,118
484,0566,DL003,The Blind Relief Association,"Lal Bahadur Shastri Marg, Near Oberoi Hotel, New Delhi-110003 Tel.No.: 011-24368529, 65650969/70 Fax No. 011-24374730 Email.: blindrelief@gmail.com ; website: www.blindrelief.org",07,127511,Aastha,,Raj,Amarjit Singh,Ragini Raj,Female,1998-11-19 00:00:00,aastharaj98@gmail.com,8178603350,273475362419,Indian,0,"3C, Pocket A, Sidharth Extension, Near Gurudwara Bala Sahib, New Delhi","3C, Pocket A, Sidharth Extension, Near Gurudwara Bala Sahib, New Delhi",110014,07,CBSE,2015,8204048,8,77.9,CBSE,2017,9182901,358,71.6,201009542419,General,95,110014,07,95
